�{�ݖ�,��������,���ݒn,�ܓx,�o�x,�d�b,��싅,���N��싅,�\�t�g�{�[��,�T�b�J�[,���N�T�b�J�[,�t�b�g�T��,�Q�[�g�{�[��,�O���E���h�E�S���t,�^�[�Q�b�g�o�[�h�f,�d���e�j�X,�\�t�g�e�j�X,���̑����O�X�|�[�c,�o���[�{�[��,�\�t�g�o���[�{�[��,�t�b�g�T��,�o�h�~���g��,�o�X�P�b�g�{�[��,�~�j�o�X�P�b�g�{�[��,�n���h�{�[��,�w���X�o���[�{�[��,�̑����Z,�싅,�_��,����,��蓹,���Ɍ�,���ю����@,������,���C��,�|��,�A�[�`�F���[,���̑������X�|�[�c,�͌�E����,�ؓ��E����,��w�E���w,�o��,���p�E����,��H�|,����,���T�C�N������,���̑������I����,�y�퉉�t,�R�[���X�E�̏�,����,����E�N��,�_���X�E���x,���K,���̑��y�̑�,�q���,��c�E���C,�u����,�W��,���\��,�f�ʉ�E���t��,�{�����e�B�A����,���̑�,�L�����v�i���񂫑��L�����v��j
����������,���c��,���R�s���s��756-4,35.8420129,139.9413877,04-7144-2988,,,,,,,,,,,,,,,,,,,,,,,,,,,,,,,,,1,,1,1,1,1,,,1,1,1,1,1,1,1,1,1,1,1,1,1,1,1,1,
����������,�u�`��,���R�s���s��756-4,35.8420129,139.9413877,04-7144-2988,,,,,,,,,,,,,,,,,,,,,,,,,,,,,,,,,1,,1,1,1,1,,,1,1,1,1,1,1,1,1,1,1,1,1,1,1,1,1,
����������,���ړI��,���R�s���s��756-4,35.8420129,139.9413877,04-7144-2988,,,,,,,,,,,,,,,,,,,,,,,,,,,,,,,,,1,,1,1,1,1,,,1,1,1,1,1,1,1,1,1,1,1,1,1,1,1,1,
����������,��P��c��,���R�s���s��756-4,35.8420129,139.9413877,04-7144-2988,,,,,,,,,,,,,,,,,,,,,,,,,,,,,,,,,1,,1,1,1,1,,,1,1,1,1,1,1,1,1,1,1,1,1,1,1,1,1,
����������,��Q��c��,���R�s���s��756-4,35.8420129,139.9413877,04-7144-2988,,,,,,,,,,,,,,,,,,,,,,,,,,,,,,,,,1,,1,1,1,1,,,1,1,1,1,1,1,1,1,1,1,1,1,1,1,1,1,
����������,�a���S���i�T���܂ށj,���R�s���s��756-4,35.8420129,139.9413877,04-7144-2988,,,,,,,,,,,,,,,,,,,,,,,,,,,,,,,,,1,1,1,1,1,1,,,1,1,1,1,1,1,1,1,1,1,1,1,1,1,1,1,
����������,��P�E��Q�a��,���R�s���s��756-4,35.8420129,139.9413877,04-7144-2988,,,,,,,,,,,,,,,,,,,,,,,,,,,,,,,,,1,1,1,1,1,1,,,1,1,1,1,1,1,1,1,1,1,1,1,1,1,1,1,
����������,��P�a��,���R�s���s��756-4,35.8420129,139.9413877,04-7144-2988,,,,,,,,,,,,,,,,,,,,,,,,,,,,,,,,,1,1,1,1,1,1,,,1,1,1,1,1,1,1,1,1,1,1,1,1,1,1,1,
����������,��Q�a��,���R�s���s��756-4,35.8420129,139.9413877,04-7144-2988,,,,,,,,,,,,,,,,,,,,,,,,,,,,,,,,,1,1,1,1,1,1,,,1,1,1,1,1,1,1,1,1,1,1,1,1,1,1,1,
����������,�T���i�a���j,���R�s���s��756-4,35.8420129,139.9413877,04-7144-2988,,,,,,,,,,,,,,,,,,,,,,,,,,,,,,,,,1,1,1,1,1,1,,,1,1,1,1,1,1,1,1,1,1,1,1,1,1,1,1,
����������,�������K��,���R�s���s��756-4,35.8420129,139.9413877,04-7144-2988,,,,,,,,,,,,,,,,,,,,,,,,,,,,,,,,,,,,,,,1,,,,,,,,,,,,,,,,1,,
