�{�ݖ�,��������,���ݒn,�ܓx,�o�x,�d�b,��싅,���N��싅,�\�t�g�{�[��,�T�b�J�[,���N�T�b�J�[,�t�b�g�T��,�Q�[�g�{�[��,�O���E���h�E�S���t,�^�[�Q�b�g�o�[�h�f,�d���e�j�X,�\�t�g�e�j�X,���̑����O�X�|�[�c,�o���[�{�[��,�\�t�g�o���[�{�[��,�t�b�g�T��,�o�h�~���g��,�o�X�P�b�g�{�[��,�~�j�o�X�P�b�g�{�[��,�n���h�{�[��,�w���X�o���[�{�[��,�̑����Z,�싅,�_��,����,��蓹,���Ɍ�,���ю����@,������,���C��,�|��,�A�[�`�F���[,���̑������X�|�[�c,�͌�E����,�ؓ��E����,��w�E���w,�o��,���p�E����,��H�|,����,���T�C�N������,���̑������I����,�y�퉉�t,�R�[���X�E�̏�,����,����E�N��,�_���X�E���x,���K,���̑��y�̑�,�q���,��c�E���C,�u����,�W��,���\��,�f�ʉ�E���t��,�{�����e�B�A����,���̑�,�L�����v�i���񂫑��L�����v��j
�X�^�[�c���������̐X�z�[��,�z�[���i�ʏ�j,���R�s���������̐X�k1-2-1,35.872735,139.924956,04-7186-7638,,,,,,,,,,,,,,,,,,,,,,,,,,,,,,,,,,,,,,,,,,1,1,1,1,1,,,,1,1,,1,1,,1,
�X�^�[�c���������̐X�z�[��,�z�[���i���Ȏ��[�j,���R�s���������̐X�k1-2-1,35.872735,139.924956,04-7186-7638,,,,,,,,,,,,,,,,,,,,,,,,,,,,,,,,,,,,,,,,,,1,1,1,1,1,1,1,1,1,1,1,1,1,1,1,
�X�^�[�c���������̐X�z�[��,�z�[���i�z���C�G��̌^�j,���R�s���������̐X�k1-2-1,35.872735,139.924956,04-7186-7638,,,,,,,,,,,,,,,,,,,,,,,,,,,,,,,,,,,,,,,,,,,,,,,,,1,,,1,,,1,1,
�X�^�[�c���������̐X�z�[��,�z���C�G�i�P�́j,���R�s���������̐X�k1-2-1,35.872735,139.924956,04-7186-7638,,,,,,,,,,,,,,,,,,,,,,,,,,,,,,,,,,,,,,,,,,,,,,,,,,,,1,,,1,1,
�X�^�[�c���������̐X�z�[��,�y���i���P�j,���R�s���������̐X�k1-2-1,35.872735,139.924956,04-7186-7638,,,,,,,,,,,,,,,,,,,,,,,,,,,,,,,,,,,,,,,,,,,,,,,,,,,,,,,,1,
�X�^�[�c���������̐X�z�[��,�y���i���Q�j,���R�s���������̐X�k1-2-1,35.872735,139.924956,04-7186-7638,,,,,,,,,,,,,,,,,,,,,,,,,,,,,,,,,,,,,,,,,,,,,,,,,,,,,,,,1,
�X�^�[�c���������̐X�z�[��,�y���i���P�{�Q�j,���R�s���������̐X�k1-2-1,35.872735,139.924956,04-7186-7638,,,,,,,,,,,,,,,,,,,,,,,,,,,,,,,,,,,,,,,,,,,,,,,,,,,,,,,,1,
�X�^�[�c���������̐X�z�[��,�y���i���j,���R�s���������̐X�k1-2-1,35.872735,139.924956,04-7186-7638,,,,,,,,,,,,,,,,,,,,,,,,,,,,,,,,,,,,,,,,,,,,,,,,,,,,,,,,1,
�X�^�[�c���������̐X�z�[��,�y���i��P�j,���R�s���������̐X�k1-2-1,35.872735,139.924956,04-7186-7638,,,,,,,,,,,,,,,,,,,,,,,,,,,,,,,,,,,,,,,,,,,,,,,,,,,,,,,,1,
�X�^�[�c���������̐X�z�[��,�y���i��Q�j,���R�s���������̐X�k1-2-1,35.872735,139.924956,04-7186-7638,,,,,,,,,,,,,,,,,,,,,,,,,,,,,,,,,,,,,,,,,,,,,,,,,,,,,,,,1,
�X�^�[�c���������̐X�z�[��,���n�[�T����,���R�s���������̐X�k1-2-1,35.872735,139.924956,04-7186-7638,,,,,,,,,,,,,,,,,,,,,,,,,,,,,,,,,,,,,,,,,,1,1,1,1,1,1,1,1,1,1,1,1,1,1,1,
�X�^�[�c���������̐X�z�[��,�X�^�W�I�P,���R�s���������̐X�k1-2-1,35.872735,139.924956,04-7186-7638,,,,,,,,,,,,,,,,,,,,,,,,,,,,,,,,,,,,,,,,,,1,1,1,1,,,,,,,,,,,1,
�X�^�[�c���������̐X�z�[��,�X�^�W�I�Q,���R�s���������̐X�k1-2-1,35.872735,139.924956,04-7186-7638,,,,,,,,,,,,,,,,,,,,,,,,,,,,,,,,,,,,,,,,,,1,1,1,1,,,,,,,,,,,1,
�X�^�[�c���������̐X�z�[��,��c���P,���R�s���������̐X�k1-2-1,35.872735,139.924956,04-7186-7638,,,,,,,,,,,,,,,,,,,,,,,,,,,,,,,,,1,1,1,1,1,1,,1,1,,,,,,,,1,1,1,1,,,1,1,
�X�^�[�c���������̐X�z�[��,��c���Q,���R�s���������̐X�k1-2-1,35.872735,139.924956,04-7186-7638,,,,,,,,,,,,,,,,,,,,,,,,,,,,,,,,,1,1,1,1,1,1,,1,1,,,,,,,,1,1,1,1,,,1,1,
�X�^�[�c���������̐X�z�[��,��c���P�{�Q,���R�s���������̐X�k1-2-1,35.872735,139.924956,04-7186-7638,,,,,,,,,,,,,,,,,,,,,,,,,,,,,,,,,1,1,1,1,1,1,,1,1,,,,,,,,1,1,1,1,,,1,1,
