�{�ݖ�,��������,���ݒn,�ܓx,�o�x,�d�b,��싅,���N��싅,�\�t�g�{�[��,�T�b�J�[,���N�T�b�J�[,�t�b�g�T��,�Q�[�g�{�[��,�O���E���h�E�S���t,�^�[�Q�b�g�o�[�h�f,�d���e�j�X,�\�t�g�e�j�X,���̑����O�X�|�[�c,�o���[�{�[��,�\�t�g�o���[�{�[��,�t�b�g�T��,�o�h�~���g��,�o�X�P�b�g�{�[��,�~�j�o�X�P�b�g�{�[��,�n���h�{�[��,�w���X�o���[�{�[��,�̑����Z,�싅,�_��,����,��蓹,���Ɍ�,���ю����@,������,���C��,�|��,�A�[�`�F���[,���̑������X�|�[�c,�͌�E����,�ؓ��E����,��w�E���w,�o��,���p�E����,��H�|,����,���T�C�N������,���̑������I����,�y�퉉�t,�R�[���X�E�̏�,����,����E�N��,�_���X�E���x,���K,���̑��y�̑�,�q���,��c�E���C,�u����,�W��,���\��,�f�ʉ�E���t��,�{�����e�B�A����,���̑�,�L�����v�i���񂫑��L�����v��j
�����̈��,���C���A���[�i�P�^�R�i�k�ʁj,���R�s��X��1-29-4,35.8587121,139.9188615,04-7159-1212,,,,,,,,,,,,,1,1,,1,,,,1,1,1,1,1,1,1,1,1,1,,,1,,,,,,,,,,,,,,,,,,,,,,,,,
�����̈��,���C���A���[�i�P�^�R�i�����ʁj,���R�s��X��1-29-4,35.8587121,139.9188615,04-7159-1212,,,,,,,,,,,,,1,1,,1,,,,1,1,1,1,1,1,1,1,1,1,,,1,,,,,,,,,,,,,,,,,,,,,,,,,
�����̈��,���C���A���[�i�P�^�R�i��ʁj,���R�s��X��1-29-4,35.8587121,139.9188615,04-7159-1212,,,,,,,,,,,,,1,1,,1,,,,1,1,1,1,1,1,1,1,1,1,,,1,,,,,,,,,,,,,,,,,,,,,,,,,
�����̈��,���C���A���[�i�P�^�Q�i�k�ʁj,���R�s��X��1-29-4,35.8587121,139.9188615,04-7159-1212,,,,,,1,,,,,,,1,1,1,1,1,1,1,1,1,1,1,1,1,1,1,1,1,,,1,,,,,,,,,,,,,,,,,,,,,,,,,
�����̈��,���C���A���[�i�P�^�Q�i��ʁj,���R�s��X��1-29-4,35.8587121,139.9188615,04-7159-1212,,,,,,,,,,,,,1,1,,1,1,1,,1,1,1,1,1,1,1,1,1,1,,,1,,,,,,,,,,,,,,,,,,,,,,,,,
�����̈��,���C���A���[�i�P�^�S�i�k�ʂ`�j,���R�s��X��1-29-4,35.8587121,139.9188615,04-7159-1212,,,,,,,,,,,,,,1,,1,,,,1,1,1,1,1,1,1,1,1,1,,,1,,,,,,,,,,,,,,,,,,,,,,,,,
�����̈��,���C���A���[�i�P�^�S�i�k�ʂa�j,���R�s��X��1-29-4,35.8587121,139.9188615,04-7159-1212,,,,,,,,,,,,,,1,,1,,,,1,1,1,1,1,1,1,1,1,1,,,1,,,,,,,,,,,,,,,,,,,,,,,,,
�����̈��,���C���A���[�i�P�^�S�i��ʂ`�j,���R�s��X��1-29-4,35.8587121,139.9188615,04-7159-1212,,,,,,,,,,,,,,1,,1,,,,1,1,1,1,1,1,1,1,1,1,,,1,,,,,,,,,,,,,,,,,,,,,,,,,
�����̈��,���C���A���[�i�P�^�S�i��ʂa�j,���R�s��X��1-29-4,35.8587121,139.9188615,04-7159-1212,,,,,,,,,,,,,,1,,1,,,,1,1,1,1,1,1,1,1,1,1,,,1,,,,,,,,,,,,,,,,,,,,,,,,,
�����̈��,���C���A���[�i�i�S�ʁj,���R�s��X��1-29-4,35.8587121,139.9188615,04-7159-1212,,,,,,1,,,,,,,1,1,1,1,1,1,1,1,1,1,1,1,1,1,1,1,1,,,1,,,,,,,,,,,,,,,,,,,,,,,,,
�����̈��,�T�u�A���[�i�P�^�Q�i�k�ʁj,���R�s��X��1-29-4,35.8587121,139.9188615,04-7159-1212,,,,,,,,,,,,,1,1,,1,1,1,,1,1,1,1,1,1,1,1,1,1,,,1,,,,,,,,,,,,,,,,,,,,,,,,,
�����̈��,�T�u�A���[�i�P�^�Q�i��ʁj,���R�s��X��1-29-4,35.8587121,139.9188615,04-7159-1212,,,,,,,,,,,,,1,1,,1,1,1,,1,1,1,1,1,1,1,1,1,1,,,1,,,,,,,,,,,,,,,,,,,,,,,,,
�����̈��,�T�u�A���[�i�i�S�ʁj,���R�s��X��1-29-4,35.8587121,139.9188615,04-7159-1212,,,,,,,,,,,,,1,1,,1,1,1,,1,1,1,1,1,1,1,1,1,1,,,1,,,,,,,,,,,,,,,,,,,,,,,,,
�����̈��,��P������,���R�s��X��1-29-4,35.8587121,139.9188615,04-7159-1212,,,,,,,,,,,,,,,,,,,,,1,,1,1,1,1,1,1,1,,,,,,,,,,,,,,,,,,,,,,,,,,,,
�����̈��,��Q������,���R�s��X��1-29-4,35.8587121,139.9188615,04-7159-1212,,,,,,,,,,,,,,,,,,,,,1,,1,1,1,1,1,1,1,,,,,,,,,,,,,,,,,,,,,,,,,,,,
�����̈��,�|����,���R�s��X��1-29-4,35.8587121,139.9188615,04-7159-1212,,,,,,,,,,,,,,,,,,,,,,,,,,,,,,1,,,,,,,,,,,,,,,,,,,,,,,,,,,
�����̈��,��c���`�A�a�i�S�ʁj,���R�s��X��1-29-4,35.8587121,139.9188615,04-7159-1212,,,,,,,,,,,,,,,,,,,,,,,,,,,,,,,,,,,,,,,,,,,,,,,,,,,,,,,,1,
�����̈��,��c���`,���R�s��X��1-29-4,35.8587121,139.9188615,04-7159-1212,,,,,,,,,,,,,,,,,,,,,,,,,,,,,,,,,,,,,,,,,,,,,,,,,,,,,,,,1,
�����̈��,��c���a,���R�s��X��1-29-4,35.8587121,139.9188615,04-7159-1212,,,,,,,,,,,,,,,,,,,,,,,,,,,,,,,,,,,,,,,,,,,,,,,,,,,,,,,,1,
�����̈��,��c���b,���R�s��X��1-29-4,35.8587121,139.9188615,04-7159-1212,,,,,,,,,,,,,,,,,,,,,,,,,,,,,,,,,,,,,,,,,,,,,,,,,,,,,,,,1,
�����̈��,��c���c,���R�s��X��1-29-4,35.8587121,139.9188615,04-7159-1212,,,,,,,,,,,,,,,,,,,,,,,,,,,,,,,,,,,,,,,,,,,,,,,,,,,,,,,,1,
