�{�ݖ�,��������,���ݒn,�ܓx,�o�x,�d�b,��싅,���N��싅,�\�t�g�{�[��,�T�b�J�[,���N�T�b�J�[,�t�b�g�T��,�Q�[�g�{�[��,�O���E���h�E�S���t,�^�[�Q�b�g�o�[�h�f,�d���e�j�X,�\�t�g�e�j�X,���̑����O�X�|�[�c,�o���[�{�[��,�\�t�g�o���[�{�[��,�t�b�g�T��,�o�h�~���g��,�o�X�P�b�g�{�[��,�~�j�o�X�P�b�g�{�[��,�n���h�{�[��,�w���X�o���[�{�[��,�̑����Z,�싅,�_��,����,��蓹,���Ɍ�,���ю����@,������,���C��,�|��,�A�[�`�F���[,���̑������X�|�[�c,�͌�E����,�ؓ��E����,��w�E���w,�o��,���p�E����,��H�|,����,���T�C�N������,���̑������I����,�y�퉉�t,�R�[���X�E�̏�,����,����E�N��,�_���X�E���x,���K,���̑��y�̑�,�q���,��c�E���C,�u����,�W��,���\��,�f�ʉ�E���t��,�{�����e�B�A����,���̑�,�L�����v�i���񂫑��L�����v��j
���R�������,����t��L��,���R�s���R2-102,35.8554154,139.8988578,04-7159-1520,,,,,,,,,,,,,,,,,,,,,,,,,,,,,,,,,1,1,1,1,1,,,,1,1,1,1,1,1,1,1,1,1,1,1,1,1,1,,
���R�������,�P�e�a���S��,���R�s���R2-102,35.8554154,139.8988578,04-7159-1520,,,,,,,,,,,,,,,,,,,,,,,,,,,,,,,,,1,1,1,1,1,1,,,1,,1,1,1,,,,1,1,1,,,,1,,
���R�������,�P�e�a���`,���R�s���R2-102,35.8554154,139.8988578,04-7159-1520,,,,,,,,,,,,,,,,,,,,,,,,,,,,,,,,,1,1,1,1,1,1,,,1,,,,,,,,1,1,,,,,1,,
���R�������,�P�e�a���a,���R�s���R2-102,35.8554154,139.8988578,04-7159-1520,,,,,,,,,,,,,,,,,,,,,,,,,,,,,,,,,1,1,1,1,1,1,,,1,,,,,,,,1,1,,,,,1,,
���R�������,�Q�e�a���S��,���R�s���R2-102,35.8554154,139.8988578,04-7159-1520,,,,,,,,,,,,,,,,,,,,,,,,,,,,,,,,,1,1,1,1,1,1,,,1,,1,1,1,,,,1,1,1,,,,1,,
���R�������,�Q�e�a���P,���R�s���R2-102,35.8554154,139.8988578,04-7159-1520,,,,,,,,,,,,,,,,,,,,,,,,,,,,,,,,,1,1,1,1,1,1,,,1,,,,,,,,1,1,,,,,1,,
���R�������,�Q�e�a���Q,���R�s���R2-102,35.8554154,139.8988578,04-7159-1520,,,,,,,,,,,,,,,,,,,,,,,,,,,,,,,,,1,1,1,1,1,1,,,1,,,,,,,,1,1,,,,,1,,
���R�������,��P��c��,���R�s���R2-102,35.8554154,139.8988578,04-7159-1520,,,,,,,,,,,,,,,,,,,,,,,,,,,,,,,,,1,1,1,1,1,1,,,1,,1,1,1,1,1,1,1,1,1,1,1,,1,,
���R�������,��Q��c��,���R�s���R2-102,35.8554154,139.8988578,04-7159-1520,,,,,,,,,,,,,,,,,,,,,,,,,,,,,,,,,1,1,1,1,1,1,,,1,,1,1,1,1,1,1,1,1,1,1,1,,1,,
���R�������,��R��c��,���R�s���R2-102,35.8554154,139.8988578,04-7159-1520,,,,,,,,,,,,,,,,,,,,,,,,,,,,,,,,,1,1,1,1,1,1,,,1,,1,1,1,1,1,1,1,1,1,1,1,,1,,
���R�������,���y��,���R�s���R2-102,35.8554154,139.8988578,04-7159-1520,,,,,,,,,,,,,,,,,,,,,,,,,,,,,,,,,,,,,,,,,,1,1,,,,1,,,,,,,,,,
