�{�ݖ�,��������,���ݒn,�ܓx,�o�x,�d�b,��싅,���N��싅,�\�t�g�{�[��,�T�b�J�[,���N�T�b�J�[,�t�b�g�T��,�Q�[�g�{�[��,�O���E���h�E�S���t,�^�[�Q�b�g�o�[�h�f,�d���e�j�X,�\�t�g�e�j�X,���̑����O�X�|�[�c,�o���[�{�[��,�\�t�g�o���[�{�[��,�t�b�g�T��,�o�h�~���g��,�o�X�P�b�g�{�[��,�~�j�o�X�P�b�g�{�[��,�n���h�{�[��,�w���X�o���[�{�[��,�̑����Z,�싅,�_��,����,��蓹,���Ɍ�,���ю����@,������,���C��,�|��,�A�[�`�F���[,���̑������X�|�[�c,�͌�E����,�ؓ��E����,��w�E���w,�o��,���p�E����,��H�|,����,���T�C�N������,���̑������I����,�y�퉉�t,�R�[���X�E�̏�,����,����E�N��,�_���X�E���x,���K,���̑��y�̑�,�q���,��c�E���C,�u����,�W��,���\��,�f�ʉ�E���t��,�{�����e�B�A����,���̑�,�L�����v�i���񂫑��L�����v��j
�여�R�Z���^�[,�z�[��,���R�s�여�R3-3-1,35.8388429,139.9017914,04-7159-4511,,,,,,,,,,,,,,,,,,,,,,,,,,,,,,,,,1,1,1,1,1,1,,1,1,1,1,1,1,1,1,1,1,1,1,1,1,1,1,1,
�여�R�Z���^�[,�u�`��,���R�s�여�R3-3-1,35.8388429,139.9017914,04-7159-4511,,,,,,,,,,,,,,,,,,,,,,,,,,,,,,,,,1,1,1,1,1,1,1,1,1,,,1,1,1,1,1,1,1,1,1,1,1,1,1,
�여�R�Z���^�[,��P��c��,���R�s�여�R3-3-1,35.8388429,139.9017914,04-7159-4511,,,,,,,,,,,,,,,,,,,,,,,,,,,,,,,,,1,1,1,1,1,1,1,1,1,,,1,1,1,1,1,1,1,1,1,1,1,1,1,
�여�R�Z���^�[,��Q��c��,���R�s�여�R3-3-1,35.8388429,139.9017914,04-7159-4511,,,,,,,,,,,,,,,,,,,,,,,,,,,,,,,,,1,1,1,1,1,1,1,1,1,,,1,1,1,1,1,1,1,1,1,1,1,1,1,
�여�R�Z���^�[,��R��c��,���R�s�여�R3-3-1,35.8388429,139.9017914,04-7159-4511,,,,,,,,,,,,,,,,,,,,,,,,,,,,,,,,,1,1,1,1,1,1,1,1,1,,,1,1,1,1,1,1,1,1,1,1,1,1,1,
�여�R�Z���^�[,��S��c��,���R�s�여�R3-3-1,35.8388429,139.9017914,04-7159-4511,,,,,,,,,,,,,,,,,,,,,,,,,,,,,,,,,1,1,1,1,1,1,1,1,1,,,1,1,1,1,1,1,1,1,1,1,1,1,1,
�여�R�Z���^�[,�a���S���i�����܂ށj,���R�s�여�R3-3-1,35.8388429,139.9017914,04-7159-4511,,,,,,,,,,,,,,,,,,,,,,,,,,,,,,,,,1,1,1,1,1,1,1,1,1,,,1,1,1,1,1,1,1,1,,,1,1,1,
�여�R�Z���^�[,��P�a���E��Q�a��,���R�s�여�R3-3-1,35.8388429,139.9017914,04-7159-4511,,,,,,,,,,,,,,,,,,,,,,,,,,,,,,,,,1,1,1,1,1,1,1,1,1,,,1,1,1,1,1,1,1,1,,,1,1,1,
�여�R�Z���^�[,��P�a��,���R�s�여�R3-3-1,35.8388429,139.9017914,04-7159-4511,,,,,,,,,,,,,,,,,,,,,,,,,,,,,,,,,1,1,1,1,1,1,1,1,1,,,1,1,1,1,1,1,1,1,,,1,1,1,
�여�R�Z���^�[,��Q�a��,���R�s�여�R3-3-1,35.8388429,139.9017914,04-7159-4511,,,,,,,,,,,,,,,,,,,,,,,,,,,,,,,,,1,1,1,1,1,1,1,1,1,,,1,1,1,1,1,1,1,1,,,1,1,1,
�여�R�Z���^�[,����,���R�s�여�R3-3-1,35.8388429,139.9017914,04-7159-4511,,,,,,,,,,,,,,,,,,,,,,,,,,,,,,,,,1,1,1,1,1,1,1,1,1,,,,,,,,,,,,,,1,1,
�여�R�Z���^�[,�������K��,���R�s�여�R3-3-1,35.8388429,139.9017914,04-7159-4511,,,,,,,,,,,,,,,,,,,,,,,,,,,,,,,,,,1,,,,,1,,1,,,,,,,,,,,,,,,1,
