�{�ݖ�,��������,���ݒn,�ܓx,�o�x,�d�b,��싅,���N��싅,�\�t�g�{�[��,�T�b�J�[,���N�T�b�J�[,�t�b�g�T��,�Q�[�g�{�[��,�O���E���h�E�S���t,�^�[�Q�b�g�o�[�h�f,�d���e�j�X,�\�t�g�e�j�X,���̑����O�X�|�[�c,�o���[�{�[��,�\�t�g�o���[�{�[��,�t�b�g�T��,�o�h�~���g��,�o�X�P�b�g�{�[��,�~�j�o�X�P�b�g�{�[��,�n���h�{�[��,�w���X�o���[�{�[��,�̑����Z,�싅,�_��,����,��蓹,���Ɍ�,���ю����@,������,���C��,�|��,�A�[�`�F���[,���̑������X�|�[�c,�͌�E����,�ؓ��E����,��w�E���w,�o��,���p�E����,��H�|,����,���T�C�N������,���̑������I����,�y�퉉�t,�R�[���X�E�̏�,����,����E�N��,�_���X�E���x,���K,���̑��y�̑�,�q���,��c�E���C,�u����,�W��,���\��,�f�ʉ�E���t��,�{�����e�B�A����,���̑�,�L�����v�i���񂫑��L�����v��j
���Ό�����,�z�[��,���R�s������4-381-2,35.8805391,139.9177359,04-7154-9101,,,,,,,,,,,,,,,,,,,,,,,,,,,,,,,,,1,1,1,1,1,1,,,1,1,1,1,1,1,1,1,1,1,1,1,1,1,1,1,
���Ό�����,�u�`��,���R�s������4-381-2,35.8805391,139.9177359,04-7154-9101,,,,,,,,,,,,,,,,,,,,,,,,,,,,,,,,,1,1,1,1,1,1,,,1,1,1,1,1,1,1,1,1,1,1,1,1,1,1,1,
���Ό�����,��c��,���R�s������4-381-2,35.8805391,139.9177359,04-7154-9101,,,,,,,,,,,,,,,,,,,,,,,,,,,,,,,,,1,1,1,1,1,1,,,1,1,1,1,1,1,1,1,1,1,1,1,1,1,1,1,
���Ό�����,�a���S���i�����܂ށj,���R�s������4-381-2,35.8805391,139.9177359,04-7154-9101,,,,,,,,,,,,,,,,,,,,,,,,,,,,,,,,,1,1,1,1,1,,,,1,1,1,1,1,1,1,1,1,1,1,1,1,1,1,1,
���Ό�����,��P�E��Q�a��,���R�s������4-381-2,35.8805391,139.9177359,04-7154-9101,,,,,,,,,,,,,,,,,,,,,,,,,,,,,,,,,1,1,1,1,1,,,,1,,,1,1,1,1,1,1,1,1,,,,1,1,
���Ό�����,��P�a��,���R�s������4-381-2,35.8805391,139.9177359,04-7154-9101,,,,,,,,,,,,,,,,,,,,,,,,,,,,,,,,,1,1,1,1,1,,,,1,,,1,1,1,1,1,1,1,1,,,,1,1,
���Ό�����,��Q�a��,���R�s������4-381-2,35.8805391,139.9177359,04-7154-9101,,,,,,,,,,,,,,,,,,,,,,,,,,,,,,,,,1,1,1,1,1,,,,1,,,1,1,1,1,1,1,1,1,,,,1,1,
���Ό�����,����,���R�s������4-381-2,35.8805391,139.9177359,04-7154-9101,,,,,,,,,,,,,,,,,,,,,,,,,,,,,,,,,,1,,,,,,,,,,,,,,,,,,,,,,,
���Ό�����,������,���R�s������4-381-2,35.8805391,139.9177359,04-7154-9101,,,,,,,,,,,,,,,,,,,,,,,,,,,,,,,,,,,,,,,1,,,,,,,,,,,,,,,,,,
