�{�ݖ�,��������,���ݒn,�ܓx,�o�x,�d�b,��싅,���N��싅,�\�t�g�{�[��,�T�b�J�[,���N�T�b�J�[,�t�b�g�T��,�Q�[�g�{�[��,�O���E���h�E�S���t,�^�[�Q�b�g�o�[�h�f,�d���e�j�X,�\�t�g�e�j�X,���̑����O�X�|�[�c,�o���[�{�[��,�\�t�g�o���[�{�[��,�t�b�g�T��,�o�h�~���g��,�o�X�P�b�g�{�[��,�~�j�o�X�P�b�g�{�[��,�n���h�{�[��,�w���X�o���[�{�[��,�̑����Z,�싅,�_��,����,��蓹,���Ɍ�,���ю����@,������,���C��,�|��,�A�[�`�F���[,���̑������X�|�[�c,�͌�E����,�ؓ��E����,��w�E���w,�o��,���p�E����,��H�|,����,���T�C�N������,���̑������I����,�y�퉉�t,�R�[���X�E�̏�,����,����E�N��,�_���X�E���x,���K,���̑��y�̑�,�q���,��c�E���C,�u����,�W��,���\��,�f�ʉ�E���t��,�{�����e�B�A����,���̑�,�L�����v�i���񂫑��L�����v��j
�R�~���j�e�B�v���U,�닅���P�R�[�g,���R�s���64-1,35.8777423,139.9093617,04-7155-5701,,,,,,,,,,1,1,,,,,,,,,,,,,,,,,,,,,,,,,,,,,,,,,,,,,,,,,,,,,,
�R�~���j�e�B�v���U,�닅���Q�R�[�g,���R�s���64-1,35.8777423,139.9093617,04-7155-5701,,,,,,,,,,1,1,,,,,,,,,,,,,,,,,,,,,,,,,,,,,,,,,,,,,,,,,,,,,,
�R�~���j�e�B�v���U,�����e�j�X�R�[�g,���R�s���64-1,35.8777423,139.9093617,04-7155-5701,,,,,,,,,,1,1,,,,,,,,,,,,,,,,,,,,,,,,,,,,,,,,,,,,,,,,,,,,,,
�R�~���j�e�B�v���U,�̈玺�S��,���R�s���64-1,35.8777423,139.9093617,04-7155-5701,,,,,,,,,,,,,1,1,,1,1,,,1,1,1,,1,1,1,1,1,1,,,1,,,,,,,,,,,,,,1,1,1,,,,,,,,,
�R�~���j�e�B�v���U,�̈玺����,���R�s���64-1,35.8777423,139.9093617,04-7155-5701,,,,,,,,,,,,,1,1,,1,1,,,1,1,1,,1,1,1,1,1,1,,,1,,,,,,,,,,,,,,1,1,1,,,,,,,,,
�R�~���j�e�B�v���U,�̈玺����,���R�s���64-1,35.8777423,139.9093617,04-7155-5701,,,,,,,,,,,,,1,1,,1,1,,,1,1,1,,1,1,1,1,1,1,,,1,,,,,,,,,,,,,,1,1,1,,,,,,,,,
�R�~���j�e�B�v���U,�̈玺���R���̂P�ʂ`,���R�s���64-1,35.8777423,139.9093617,04-7155-5701,,,,,,,,,,,,,,,,,,,,,1,1,,1,1,1,1,1,1,,,1,,,,,,,,,,,,,,1,1,1,,,,,,,,,
�R�~���j�e�B�v���U,�̈玺���R���̂P�ʂa,���R�s���64-1,35.8777423,139.9093617,04-7155-5701,,,,,,,,,,,,,,,,,,,,,1,1,,1,1,1,1,1,1,,,1,,,,,,,,,,,,,,1,1,1,,,,,,,,,
�R�~���j�e�B�v���U,�̈玺���R���̂P�ʂb,���R�s���64-1,35.8777423,139.9093617,04-7155-5701,,,,,,,,,,,,,,,,,,,,,1,1,,1,1,1,1,1,1,,,1,,,,,,,,,,,,,,1,1,1,,,,,,,,,
�R�~���j�e�B�v���U,�̈玺���R���̂P�ʂ`,���R�s���64-1,35.8777423,139.9093617,04-7155-5701,,,,,,,,,,,,,,,,1,,,,1,1,1,,1,1,1,1,1,1,,,1,,,,,,,,,,,,,,1,1,1,,,,,,,,,
�R�~���j�e�B�v���U,�̈玺���R���̂P�ʂa,���R�s���64-1,35.8777423,139.9093617,04-7155-5701,,,,,,,,,,,,,,,,1,,,,1,1,1,,1,1,1,1,1,1,,,1,,,,,,,,,,,,,,1,1,1,,,,,,,,,
�R�~���j�e�B�v���U,�̈玺���R���̂P�ʂb,���R�s���64-1,35.8777423,139.9093617,04-7155-5701,,,,,,,,,,,,,,,,1,,,,1,1,1,,1,1,1,1,1,1,,,1,,,,,,,,,,,,,,1,1,1,,,,,,,,,
�R�~���j�e�B�v���U,�`��c��,���R�s���64-1,35.8777423,139.9093617,04-7155-5701,,,,,,,,,,,,,,,,,,,,,,,,,,,,,,,,,1,1,1,1,1,1,,1,1,,,1,1,,,,1,1,1,1,1,,1,1,
�R�~���j�e�B�v���U,�a��c��,���R�s���64-1,35.8777423,139.9093617,04-7155-5701,,,,,,,,,,,,,,,,,,,,,,,,,,,,,,,,,1,1,1,1,1,1,,1,1,,,1,1,,,,1,1,1,1,1,,1,1,
�R�~���j�e�B�v���U,�b��c��,���R�s���64-1,35.8777423,139.9093617,04-7155-5701,,,,,,,,,,,,,,,,,,,,,,,,,,,,,,,,,1,1,1,1,1,1,,1,1,,,1,1,,,,1,1,1,1,1,,1,1,
�R�~���j�e�B�v���U,���C��,���R�s���64-1,35.8777423,139.9093617,04-7155-5701,,,,,,,,,,,,,,,,,,,,,,,,,,,,,,,,,1,1,1,1,1,1,,1,1,,,1,1,,,,1,1,1,1,1,,1,1,
�R�~���j�e�B�v���U,���������i�a���P�j,���R�s���64-1,35.8777423,139.9093617,04-7155-5701,,,,,,,,,,,,,,,,,,,,,,,,,,1,1,,,,,,1,1,1,1,1,1,,1,1,,,1,1,1,1,1,1,1,1,1,1,,1,1,
�R�~���j�e�B�v���U,���������i�a���Q�j,���R�s���64-1,35.8777423,139.9093617,04-7155-5701,,,,,,,,,,,,,,,,,,,,,,,,,,1,1,,,,,,1,1,1,1,1,1,,1,1,,,1,1,1,1,1,1,1,1,1,1,,1,1,
�R�~���j�e�B�v���U,�����o��,���R�s���64-1,35.8777423,139.9093617,04-7155-5701,,,,,,,,,,,,,,,,,,,,,,,,,,,,,,,,,1,1,1,1,1,1,,1,1,1,1,1,1,,1,1,1,1,1,1,1,1,1,1,
