�{�ݖ�,��������,���ݒn,�ܓx,�o�x,�d�b,��싅,���N��싅,�\�t�g�{�[��,�T�b�J�[,���N�T�b�J�[,�t�b�g�T��,�Q�[�g�{�[��,�O���E���h�E�S���t,�^�[�Q�b�g�o�[�h�f,�d���e�j�X,�\�t�g�e�j�X,���̑����O�X�|�[�c,�o���[�{�[��,�\�t�g�o���[�{�[��,�t�b�g�T��,�o�h�~���g��,�o�X�P�b�g�{�[��,�~�j�o�X�P�b�g�{�[��,�n���h�{�[��,�w���X�o���[�{�[��,�̑����Z,�싅,�_��,����,��蓹,���Ɍ�,���ю����@,������,���C��,�|��,�A�[�`�F���[,���̑������X�|�[�c,�͌�E����,�ؓ��E����,��w�E���w,�o��,���p�E����,��H�|,����,���T�C�N������,���̑������I����,�y�퉉�t,�R�[���X�E�̏�,����,����E�N��,�_���X�E���x,���K,���̑��y�̑�,�q���,��c�E���C,�u����,�W��,���\��,�f�ʉ�E���t��,�{�����e�B�A����,���̑�,�L�����v�i���񂫑��L�����v��j
�����̈��,���C���A���[�i�P�^�R�i�k�ʁj,���R�s��X��1-29-4,35.8587121,139.9188615,04-7159-1212,,,,,,,,,,,,,1,1,,1,,,,1,1,1,1,1,1,1,1,1,1,,,1,,,,,,,,,,,,,,,,,,,,,,,,,
�����̈��,���C���A���[�i�P�^�R�i�����ʁj,���R�s��X��1-29-4,35.8587121,139.9188615,04-7159-1212,,,,,,,,,,,,,1,1,,1,,,,1,1,1,1,1,1,1,1,1,1,,,1,,,,,,,,,,,,,,,,,,,,,,,,,
�����̈��,���C���A���[�i�P�^�R�i��ʁj,���R�s��X��1-29-4,35.8587121,139.9188615,04-7159-1212,,,,,,,,,,,,,1,1,,1,,,,1,1,1,1,1,1,1,1,1,1,,,1,,,,,,,,,,,,,,,,,,,,,,,,,
�����̈��,���C���A���[�i�P�^�Q�i�k�ʁj,���R�s��X��1-29-4,35.8587121,139.9188615,04-7159-1212,,,,,,1,,,,,,,1,1,1,1,1,1,1,1,1,1,1,1,1,1,1,1,1,,,1,,,,,,,,,,,,,,,,,,,,,,,,,
�����̈��,���C���A���[�i�P�^�Q�i��ʁj,���R�s��X��1-29-4,35.8587121,139.9188615,04-7159-1212,,,,,,,,,,,,,1,1,,1,1,1,,1,1,1,1,1,1,1,1,1,1,,,1,,,,,,,,,,,,,,,,,,,,,,,,,
�����̈��,���C���A���[�i�P�^�S�i�k�ʂ`�j,���R�s��X��1-29-4,35.8587121,139.9188615,04-7159-1212,,,,,,,,,,,,,,1,,1,,,,1,1,1,1,1,1,1,1,1,1,,,1,,,,,,,,,,,,,,,,,,,,,,,,,
�����̈��,���C���A���[�i�P�^�S�i�k�ʂa�j,���R�s��X��1-29-4,35.8587121,139.9188615,04-7159-1212,,,,,,,,,,,,,,1,,1,,,,1,1,1,1,1,1,1,1,1,1,,,1,,,,,,,,,,,,,,,,,,,,,,,,,
�����̈��,���C���A���[�i�P�^�S�i��ʂ`�j,���R�s��X��1-29-4,35.8587121,139.9188615,04-7159-1212,,,,,,,,,,,,,,1,,1,,,,1,1,1,1,1,1,1,1,1,1,,,1,,,,,,,,,,,,,,,,,,,,,,,,,
�����̈��,���C���A���[�i�P�^�S�i��ʂa�j,���R�s��X��1-29-4,35.8587121,139.9188615,04-7159-1212,,,,,,,,,,,,,,1,,1,,,,1,1,1,1,1,1,1,1,1,1,,,1,,,,,,,,,,,,,,,,,,,,,,,,,
�����̈��,���C���A���[�i�i�S�ʁj,���R�s��X��1-29-4,35.8587121,139.9188615,04-7159-1212,,,,,,1,,,,,,,1,1,1,1,1,1,1,1,1,1,1,1,1,1,1,1,1,,,1,,,,,,,,,,,,,,,,,,,,,,,,,
�����̈��,�T�u�A���[�i�P�^�Q�i�k�ʁj,���R�s��X��1-29-4,35.8587121,139.9188615,04-7159-1212,,,,,,,,,,,,,1,1,,1,1,1,,1,1,1,1,1,1,1,1,1,1,,,1,,,,,,,,,,,,,,,,,,,,,,,,,
�����̈��,�T�u�A���[�i�P�^�Q�i��ʁj,���R�s��X��1-29-4,35.8587121,139.9188615,04-7159-1212,,,,,,,,,,,,,1,1,,1,1,1,,1,1,1,1,1,1,1,1,1,1,,,1,,,,,,,,,,,,,,,,,,,,,,,,,
�����̈��,�T�u�A���[�i�i�S�ʁj,���R�s��X��1-29-4,35.8587121,139.9188615,04-7159-1212,,,,,,,,,,,,,1,1,,1,1,1,,1,1,1,1,1,1,1,1,1,1,,,1,,,,,,,,,,,,,,,,,,,,,,,,,
�����̈��,��P������,���R�s��X��1-29-4,35.8587121,139.9188615,04-7159-1212,,,,,,,,,,,,,,,,,,,,,1,,1,1,1,1,1,1,1,,,,,,,,,,,,,,,,,,,,,,,,,,,,
�����̈��,��Q������,���R�s��X��1-29-4,35.8587121,139.9188615,04-7159-1212,,,,,,,,,,,,,,,,,,,,,1,,1,1,1,1,1,1,1,,,,,,,,,,,,,,,,,,,,,,,,,,,,
�����̈��,�|����,���R�s��X��1-29-4,35.8587121,139.9188615,04-7159-1212,,,,,,,,,,,,,,,,,,,,,,,,,,,,,,1,,,,,,,,,,,,,,,,,,,,,,,,,,,
�����̈��,��c���`�A�a�i�S�ʁj,���R�s��X��1-29-4,35.8587121,139.9188615,04-7159-1212,,,,,,,,,,,,,,,,,,,,,,,,,,,,,,,,,,,,,,,,,,,,,,,,,,,,,,,,1,
�����̈��,��c���`,���R�s��X��1-29-4,35.8587121,139.9188615,04-7159-1212,,,,,,,,,,,,,,,,,,,,,,,,,,,,,,,,,,,,,,,,,,,,,,,,,,,,,,,,1,
�����̈��,��c���a,���R�s��X��1-29-4,35.8587121,139.9188615,04-7159-1212,,,,,,,,,,,,,,,,,,,,,,,,,,,,,,,,,,,,,,,,,,,,,,,,,,,,,,,,1,
�����̈��,��c���b,���R�s��X��1-29-4,35.8587121,139.9188615,04-7159-1212,,,,,,,,,,,,,,,,,,,,,,,,,,,,,,,,,,,,,,,,,,,,,,,,,,,,,,,,1,
�����̈��,��c���c,���R�s��X��1-29-4,35.8587121,139.9188615,04-7159-1212,,,,,,,,,,,,,,,,,,,,,,,,,,,,,,,,,,,,,,,,,,,,,,,,,,,,,,,,1,
�����^������,�싅��i��j,���R�s��X��1-29-4,35.8587121,139.9188615,04-7159-1212,1,1,1,,,,,,,,,,,,,,,,,,,,,,,,,,,,,,,,,,,,,,,,,,,,,,,,,,,,,,
�����^������,�닅��P�R�[�g,���R�s��X��1-29-4,35.8587121,139.9188615,04-7159-1212,,,,,,,,,,1,1,,,,,,,,,,,,,,,,,,,,,,,,,,,,,,,,,,,,,,,,,,,,,,
�����^������,�닅��Q�R�[�g,���R�s��X��1-29-4,35.8587121,139.9188615,04-7159-1212,,,,,,,,,,1,1,,,,,,,,,,,,,,,,,,,,,,,,,,,,,,,,,,,,,,,,,,,,,,
�����^������,�닅��R�R�[�g,���R�s��X��1-29-4,35.8587121,139.9188615,04-7159-1212,,,,,,,,,,1,1,,,,,,,,,,,,,,,,,,,,,,,,,,,,,,,,,,,,,,,,,,,,,,
�����^������,�닅��S�R�[�g,���R�s��X��1-29-4,35.8587121,139.9188615,04-7159-1212,,,,,,,,,,1,1,,,,,,,,,,,,,,,,,,,,,,,,,,,,,,,,,,,,,,,,,,,,,,
�����^������,�닅��T�R�[�g,���R�s��X��1-29-4,35.8587121,139.9188615,04-7159-1212,,,,,,,,,,1,1,,,,,,,,,,,,,,,,,,,,,,,,,,,,,,,,,,,,,,,,,,,,,,
�����^������,�닅��U�R�[�g,���R�s��X��1-29-4,35.8587121,139.9188615,04-7159-1212,,,,,,,,,,1,1,,,,,,,,,,,,,,,,,,,,,,,,,,,,,,,,,,,,,,,,,,,,,,
�����^������,�닅��V�R�[�g,���R�s��X��1-29-4,35.8587121,139.9188615,04-7159-1212,,,,,,,,,,1,1,,,,,,,,,,,,,,,,,,,,,,,,,,,,,,,,,,,,,,,,,,,,,,
�����^������,�닅��W�R�[�g,���R�s��X��1-29-4,35.8587121,139.9188615,04-7159-1212,,,,,,,,,,1,1,,,,,,,,,,,,,,,,,,,,,,,,,,,,,,,,,,,,,,,,,,,,,,
�k���_����,�k���_����,���R�s�c109-3,35.9004081,139.9279148,04-7159-1212,,,,,,,,,,,,,,,,,,,,,1,,1,,1,1,1,1,1,,,,,,,,,,,,,,,,,,1,1,,,,,,,,,
�암�_����,�암�_����,���R�s���R985-1,35.844848,139.901142,04-7159-1212,,,,,,,,,,,,,,,,,,,,,1,,1,,1,1,1,1,1,,,,,,,,,,,,,,,,,,1,1,,,,,,,,,
�]�ː�͐�~�Βn,�싅��`�ʁi��j,���R�s�ؒn��,35.8433,139.891126,04-7159-1212,1,1,1,,,,,,,,,,,,,,,,,,,,,,,,,,,,,,,,,,,,,,,,,,,,,,,,,,,,,,
�]�ː�͐�~�Βn,�싅��a�ʁi��j,���R�s�ؒn��,35.8433,139.891126,04-7159-1212,1,1,1,,,,,,,,,,,,,,,,,,,,,,,,,,,,,,,,,,,,,,,,,,,,,,,,,,,,,,
�]�ː�͐�~�Βn,�싅��b�ʁi��j,���R�s�ؒn��,35.8433,139.891126,04-7159-1212,1,1,1,,,,,,,,,,,,,,,,,,,,,,,,,,,,,,,,,,,,,,,,,,,,,,,,,,,,,,
�]�ː�͐�~�Βn,�싅��c�ʁi��j,���R�s�ؒn��,35.8433,139.891126,04-7159-1212,1,1,1,,,,,,,,,,,,,,,,,,,,,,,,,,,,,,,,,,,,,,,,,,,,,,,,,,,,,,
�]�ː�͐�~�Βn,�싅��d�ʁi��j,���R�s�ؒn��,35.8433,139.891126,04-7159-1212,1,1,1,,,,,,,,,,,,,,,,,,,,,,,,,,,,,,,,,,,,,,,,,,,,,,,,,,,,,,
�]�ː�͐�~�Βn,�싅��e�ʁi��j,���R�s�ؒn��,35.8433,139.891126,04-7159-1212,1,1,1,,,,,,,,,,,,,,,,,,,,,,,,,,,,,,,,,,,,,,,,,,,,,,,,,,,,,,
�]�ː�͐�~�Βn,�싅��f�ʁi���N��싅�j,���R�s�ؒn��,35.8433,139.891126,04-7159-1212,,1,1,,,,,,,,,,,,,,,,,,,,,,,,,,,,,,,,,,,,,,,,,,,,,,,,,,,,,,
���R�X�|�[�c�t�B�[���h,�`��,���R�s���ԗ�337-1,35.87382,139.901909,04-7157-2225,,1,1,1,1,1,1,1,1,,,,,,,,,,,,,,,,,,,,,,,,,,,,,,,,,,,,,,,,,,,,,,,,
���R�X�|�[�c�t�B�[���h,�a��,���R�s���ԗ�337-1,35.87382,139.901909,04-7157-2225,,1,1,1,1,1,1,1,1,,,,,,,,,,,,,,,,,,,,,,,,,,,,,,,,,,,,,,,,,,,,,,,,
���R�X�|�[�c�t�B�[���h,�`�P�^�Q�k��,���R�s���ԗ�337-1,35.87382,139.901909,04-7157-2225,,1,1,1,1,1,1,1,1,,,,,,,,,,,,,,,,,,,,,,,,,,,,,,,,,,,,,,,,,,,,,,,,
���R�X�|�[�c�t�B�[���h,�`�P�^�Q���,���R�s���ԗ�337-1,35.87382,139.901909,04-7157-2225,,1,1,1,1,1,1,1,1,,,,,,,,,,,,,,,,,,,,,,,,,,,,,,,,,,,,,,,,,,,,,,,,
���R�X�|�[�c�t�B�[���h,�a�P�^�Q�k��,���R�s���ԗ�337-1,35.87382,139.901909,04-7157-2225,,1,1,1,1,1,1,1,1,,,,,,,,,,,,,,,,,,,,,,,,,,,,,,,,,,,,,,,,,,,,,,,,
���R�X�|�[�c�t�B�[���h,�a�P�^�Q���,���R�s���ԗ�337-1,35.87382,139.901909,04-7157-2225,,1,1,1,1,1,1,1,1,,,,,,,,,,,,,,,,,,,,,,,,,,,,,,,,,,,,,,,,,,,,,,,,
���R�X�|�[�c�t�B�[���h,�b�ʁi�����r���^����j,���R�s���ԗ�337-1,35.87382,139.901909,04-7157-2225,,1,1,1,1,1,1,1,1,,,,,,,,,,,,,,,,,,,,,,,,,,,,,,,,,,,,,,,,,,,,,,,,
�����X�|�[�c�t�B�[���h,���ړI�^����,���R�s���s��121-1,35.850057,139.937335,04-7157-2225,,,1,1,1,1,1,1,1,,,,,,,,,,,,,,,,,,,,,,,,,,,,,,,,,,,,,,,,,,,,,,,,
���������̐X�X�|�[�c�t�B�[���h,���ړI�^����,���R�s���113-3,35.87662,139.909387,04-7157-2225,,1,1,1,1,1,1,1,1,,,,,,,,,,,,,,,,,,,,,,,,,,,,,,,,,,,,,,,,,,,,,,,,
���������̐X�X�|�[�c�t�B�[���h,���ړI�P�^�Q�`��,���R�s���113-3,35.87662,139.909387,04-7157-2225,,1,1,1,1,1,1,1,1,,,,,,,,,,,,,,,,,,,,,,,,,,,,,,,,,,,,,,,,,,,,,,,,
���������̐X�X�|�[�c�t�B�[���h,���ړI�P�^�Q�a��,���R�s���113-3,35.87662,139.909387,04-7157-2225,,1,1,1,1,1,1,1,1,,,,,,,,,,,,,,,,,,,,,,,,,,,,,,,,,,,,,,,,,,,,,,,,
���������̐X�X�|�[�c�t�B�[���h,���ړI�b��,���R�s���113-3,35.87662,139.909387,04-7157-2225,,1,1,,1,1,1,1,1,,,,,,,,,,,,,,,,,,,,,,,,,,,,,,,,,,,,,,,,,,,,,,,,
�R�~���j�e�B�v���U,�닅���P�R�[�g,���R�s���64-1,35.8777423,139.9093617,04-7155-5701,,,,,,,,,,1,1,,,,,,,,,,,,,,,,,,,,,,,,,,,,,,,,,,,,,,,,,,,,,,
�R�~���j�e�B�v���U,�닅���Q�R�[�g,���R�s���64-1,35.8777423,139.9093617,04-7155-5701,,,,,,,,,,1,1,,,,,,,,,,,,,,,,,,,,,,,,,,,,,,,,,,,,,,,,,,,,,,
�R�~���j�e�B�v���U,�����e�j�X�R�[�g,���R�s���64-1,35.8777423,139.9093617,04-7155-5701,,,,,,,,,,1,1,,,,,,,,,,,,,,,,,,,,,,,,,,,,,,,,,,,,,,,,,,,,,,
�R�~���j�e�B�v���U,�̈玺�S��,���R�s���64-1,35.8777423,139.9093617,04-7155-5701,,,,,,,,,,,,,1,1,,1,1,,,1,1,1,,1,1,1,1,1,1,,,1,,,,,,,,,,,,,,1,1,1,,,,,,,,,
�R�~���j�e�B�v���U,�̈玺����,���R�s���64-1,35.8777423,139.9093617,04-7155-5701,,,,,,,,,,,,,1,1,,1,1,,,1,1,1,,1,1,1,1,1,1,,,1,,,,,,,,,,,,,,1,1,1,,,,,,,,,
�R�~���j�e�B�v���U,�̈玺����,���R�s���64-1,35.8777423,139.9093617,04-7155-5701,,,,,,,,,,,,,1,1,,1,1,,,1,1,1,,1,1,1,1,1,1,,,1,,,,,,,,,,,,,,1,1,1,,,,,,,,,
�R�~���j�e�B�v���U,�̈玺���R���̂P�ʂ`,���R�s���64-1,35.8777423,139.9093617,04-7155-5701,,,,,,,,,,,,,,,,,,,,,1,1,,1,1,1,1,1,1,,,1,,,,,,,,,,,,,,1,1,1,,,,,,,,,
�R�~���j�e�B�v���U,�̈玺���R���̂P�ʂa,���R�s���64-1,35.8777423,139.9093617,04-7155-5701,,,,,,,,,,,,,,,,,,,,,1,1,,1,1,1,1,1,1,,,1,,,,,,,,,,,,,,1,1,1,,,,,,,,,
�R�~���j�e�B�v���U,�̈玺���R���̂P�ʂb,���R�s���64-1,35.8777423,139.9093617,04-7155-5701,,,,,,,,,,,,,,,,,,,,,1,1,,1,1,1,1,1,1,,,1,,,,,,,,,,,,,,1,1,1,,,,,,,,,
�R�~���j�e�B�v���U,�̈玺���R���̂P�ʂ`,���R�s���64-1,35.8777423,139.9093617,04-7155-5701,,,,,,,,,,,,,,,,1,,,,1,1,1,,1,1,1,1,1,1,,,1,,,,,,,,,,,,,,1,1,1,,,,,,,,,
�R�~���j�e�B�v���U,�̈玺���R���̂P�ʂa,���R�s���64-1,35.8777423,139.9093617,04-7155-5701,,,,,,,,,,,,,,,,1,,,,1,1,1,,1,1,1,1,1,1,,,1,,,,,,,,,,,,,,1,1,1,,,,,,,,,
�R�~���j�e�B�v���U,�̈玺���R���̂P�ʂb,���R�s���64-1,35.8777423,139.9093617,04-7155-5701,,,,,,,,,,,,,,,,1,,,,1,1,1,,1,1,1,1,1,1,,,1,,,,,,,,,,,,,,1,1,1,,,,,,,,,
�R�~���j�e�B�v���U,�`��c��,���R�s���64-1,35.8777423,139.9093617,04-7155-5701,,,,,,,,,,,,,,,,,,,,,,,,,,,,,,,,,1,1,1,1,1,1,,1,1,,,1,1,,,,1,1,1,1,1,,1,1,
�R�~���j�e�B�v���U,�a��c��,���R�s���64-1,35.8777423,139.9093617,04-7155-5701,,,,,,,,,,,,,,,,,,,,,,,,,,,,,,,,,1,1,1,1,1,1,,1,1,,,1,1,,,,1,1,1,1,1,,1,1,
�R�~���j�e�B�v���U,�b��c��,���R�s���64-1,35.8777423,139.9093617,04-7155-5701,,,,,,,,,,,,,,,,,,,,,,,,,,,,,,,,,1,1,1,1,1,1,,1,1,,,1,1,,,,1,1,1,1,1,,1,1,
�R�~���j�e�B�v���U,���C��,���R�s���64-1,35.8777423,139.9093617,04-7155-5701,,,,,,,,,,,,,,,,,,,,,,,,,,,,,,,,,1,1,1,1,1,1,,1,1,,,1,1,,,,1,1,1,1,1,,1,1,
�R�~���j�e�B�v���U,���������i�a���P�j,���R�s���64-1,35.8777423,139.9093617,04-7155-5701,,,,,,,,,,,,,,,,,,,,,,,,,,1,1,,,,,,1,1,1,1,1,1,,1,1,,,1,1,1,1,1,1,1,1,1,1,,1,1,
�R�~���j�e�B�v���U,���������i�a���Q�j,���R�s���64-1,35.8777423,139.9093617,04-7155-5701,,,,,,,,,,,,,,,,,,,,,,,,,,1,1,,,,,,1,1,1,1,1,1,,1,1,,,1,1,1,1,1,1,1,1,1,1,,1,1,
�R�~���j�e�B�v���U,�����o��,���R�s���64-1,35.8777423,139.9093617,04-7155-5701,,,,,,,,,,,,,,,,,,,,,,,,,,,,,,,,,1,1,1,1,1,1,,1,1,1,1,1,1,,1,1,1,1,1,1,1,1,1,1,
�s�����,�z�[��,���R�s��1-16-2,35.8602174,139.9052682,04-7158-3462,,,,,,,,,,,,,,,,,,,,,,,,,,,,,,,,,,,,,,,,,1,1,1,1,1,1,1,1,1,1,1,1,1,1,1,1,
�s�����,�z���C�G,���R�s��1-16-2,35.8602174,139.9052682,04-7158-3462,,,,,,,,,,,,,,,,,,,,,,,,,,,,,,,,,,,,,,,,,1,1,1,1,1,1,1,1,1,1,1,1,1,1,1,1,
�s�����,����,���R�s��1-16-2,35.8602174,139.9052682,04-7158-3462,,,,,,,,,,,,,,,,,,,,,,,,,,,,,,,,,,,,,,,,,1,1,1,1,1,1,1,1,1,,,,,,1,1,
����������,�u�`��,���R�s��1-16-2,35.8602174,139.9052682,04-7158-3462,,,,,,,,,,,,,,,,,,,,,,,,,,,,,,,,,1,1,1,1,1,1,,,1,,,1,1,1,1,1,1,1,1,1,1,,1,1,
����������,��P��c��,���R�s��1-16-2,35.8602174,139.9052682,04-7158-3462,,,,,,,,,,,,,,,,,,,,,,,,,,,,,,,,,1,1,1,1,1,1,,,1,,,1,1,1,1,1,1,1,1,1,1,,1,1,
����������,��Q��c��,���R�s��1-16-2,35.8602174,139.9052682,04-7158-3462,,,,,,,,,,,,,,,,,,,,,,,,,,,,,,,,,1,1,1,1,1,1,,,1,,,1,1,1,1,1,1,1,1,1,1,,1,1,
����������,��R��c��,���R�s��1-16-2,35.8602174,139.9052682,04-7158-3462,,,,,,,,,,,,,,,,,,,,,,,,,,,,,,,,,1,1,1,1,1,1,,,1,,,1,1,1,1,1,1,1,1,1,1,,1,1,
����������,��S��c��,���R�s��1-16-2,35.8602174,139.9052682,04-7158-3462,,,,,,,,,,,,,,,,,,,,,,,,,,,,,,,,,1,1,1,1,1,1,,,1,,,1,1,1,1,1,1,1,1,1,1,,1,1,
����������,��T��c��,���R�s��1-16-2,35.8602174,139.9052682,04-7158-3462,,,,,,,,,,,,,,,,,,,,,,,,,,,,,,,,,1,1,1,1,1,1,,,1,,,1,1,1,1,1,1,1,1,1,1,,1,1,
����������,��U��c��,���R�s��1-16-2,35.8602174,139.9052682,04-7158-3462,,,,,,,,,,,,,,,,,,,,,,,,,,,,,,,,,1,1,1,1,1,1,,,1,,,1,1,1,1,1,1,1,1,1,1,,1,1,
����������,�a��,���R�s��1-16-2,35.8602174,139.9052682,04-7158-3462,,,,,,,,,,,,,,,,,,,,,,,,,,,,,,,,,1,1,1,1,1,1,,,1,,,1,1,1,1,1,1,1,1,1,1,,1,1,
����������,������,���R�s��1-16-2,35.8602174,139.9052682,04-7158-3462,,,,,,,,,,,,,,,,,,,,,,,,,,,,,,,,,,,,,,,1,,,,,,,,,,,,,,,,,,
�k��������,���c��,���R�s����1-158-2,35.897736,139.9041949,04-7153-0567,,,,,,,,,,,,,,,,,,,,,,,,,,,,,,,,,1,1,1,1,1,1,,,1,1,1,1,1,1,1,1,1,1,1,1,1,1,1,1,
�k��������,�u�`��,���R�s����1-158-2,35.897736,139.9041949,04-7153-0567,,,,,,,,,,,,,,,,,,,,,,,,,,,,,,,,,1,1,1,1,1,1,,,1,1,1,1,1,1,1,1,1,1,1,1,1,1,1,1,
�k��������,��P��c��,���R�s����1-158-2,35.897736,139.9041949,04-7153-0567,,,,,,,,,,,,,,,,,,,,,,,,,,,,,,,,,1,1,1,1,1,1,,,1,1,1,1,1,1,1,1,1,1,1,1,1,1,1,1,
�k��������,��Q��c��,���R�s����1-158-2,35.897736,139.9041949,04-7153-0567,,,,,,,,,,,,,,,,,,,,,,,,,,,,,,,,,1,1,1,1,1,1,,,1,1,1,1,1,1,1,1,1,1,1,1,1,1,1,1,
�k��������,��R��c��,���R�s����1-158-2,35.897736,139.9041949,04-7153-0567,,,,,,,,,,,,,,,,,,,,,,,,,,,,,,,,,1,1,1,1,1,1,,,1,1,1,1,1,1,1,1,1,1,1,1,1,1,1,1,
�k��������,��S��c��,���R�s����1-158-2,35.897736,139.9041949,04-7153-0567,,,,,,,,,,,,,,,,,,,,,,,,,,,,,,,,,1,1,1,1,1,1,,,1,1,1,1,1,1,1,1,1,1,1,1,1,1,1,1,
�k��������,�a��,���R�s����1-158-2,35.897736,139.9041949,04-7153-0567,,,,,,,,,,,,,,,,,,,,,,,,,,,,,,,,,1,1,1,1,1,1,,,1,1,1,1,1,1,1,1,1,1,1,1,1,1,1,1,
�k��������,������,���R�s����1-158-2,35.897736,139.9041949,04-7153-0567,,,,,,,,,,,,,,,,,,,,,,,,,,,,,,,,,,,,,,,1,,,,,,,,,,,,,,,,,,
����������,���c��,���R�s���s��756-4,35.8420129,139.9413877,04-7144-2988,,,,,,,,,,,,,,,,,,,,,,,,,,,,,,,,,1,,1,1,1,1,,,1,1,1,1,1,1,1,1,1,1,1,1,1,1,1,1,
����������,�u�`��,���R�s���s��756-4,35.8420129,139.9413877,04-7144-2988,,,,,,,,,,,,,,,,,,,,,,,,,,,,,,,,,1,,1,1,1,1,,,1,1,1,1,1,1,1,1,1,1,1,1,1,1,1,1,
����������,���ړI��,���R�s���s��756-4,35.8420129,139.9413877,04-7144-2988,,,,,,,,,,,,,,,,,,,,,,,,,,,,,,,,,1,,1,1,1,1,,,1,1,1,1,1,1,1,1,1,1,1,1,1,1,1,1,
����������,��P��c��,���R�s���s��756-4,35.8420129,139.9413877,04-7144-2988,,,,,,,,,,,,,,,,,,,,,,,,,,,,,,,,,1,,1,1,1,1,,,1,1,1,1,1,1,1,1,1,1,1,1,1,1,1,1,
����������,��Q��c��,���R�s���s��756-4,35.8420129,139.9413877,04-7144-2988,,,,,,,,,,,,,,,,,,,,,,,,,,,,,,,,,1,,1,1,1,1,,,1,1,1,1,1,1,1,1,1,1,1,1,1,1,1,1,
����������,�a���S���i�T���܂ށj,���R�s���s��756-4,35.8420129,139.9413877,04-7144-2988,,,,,,,,,,,,,,,,,,,,,,,,,,,,,,,,,1,1,1,1,1,1,,,1,1,1,1,1,1,1,1,1,1,1,1,1,1,1,1,
����������,��P�E��Q�a��,���R�s���s��756-4,35.8420129,139.9413877,04-7144-2988,,,,,,,,,,,,,,,,,,,,,,,,,,,,,,,,,1,1,1,1,1,1,,,1,1,1,1,1,1,1,1,1,1,1,1,1,1,1,1,
����������,��P�a��,���R�s���s��756-4,35.8420129,139.9413877,04-7144-2988,,,,,,,,,,,,,,,,,,,,,,,,,,,,,,,,,1,1,1,1,1,1,,,1,1,1,1,1,1,1,1,1,1,1,1,1,1,1,1,
����������,��Q�a��,���R�s���s��756-4,35.8420129,139.9413877,04-7144-2988,,,,,,,,,,,,,,,,,,,,,,,,,,,,,,,,,1,1,1,1,1,1,,,1,1,1,1,1,1,1,1,1,1,1,1,1,1,1,1,
����������,�T���i�a���j,���R�s���s��756-4,35.8420129,139.9413877,04-7144-2988,,,,,,,,,,,,,,,,,,,,,,,,,,,,,,,,,1,1,1,1,1,1,,,1,1,1,1,1,1,1,1,1,1,1,1,1,1,1,1,
����������,�������K��,���R�s���s��756-4,35.8420129,139.9413877,04-7144-2988,,,,,,,,,,,,,,,,,,,,,,,,,,,,,,,,,,,,,,,1,,,,,,,,,,,,,,,,1,,
���Ό�����,�z�[��,���R�s������4-381-2,35.8805391,139.9177359,04-7154-9101,,,,,,,,,,,,,,,,,,,,,,,,,,,,,,,,,1,1,1,1,1,1,,,1,1,1,1,1,1,1,1,1,1,1,1,1,1,1,1,
���Ό�����,�u�`��,���R�s������4-381-2,35.8805391,139.9177359,04-7154-9101,,,,,,,,,,,,,,,,,,,,,,,,,,,,,,,,,1,1,1,1,1,1,,,1,1,1,1,1,1,1,1,1,1,1,1,1,1,1,1,
���Ό�����,��c��,���R�s������4-381-2,35.8805391,139.9177359,04-7154-9101,,,,,,,,,,,,,,,,,,,,,,,,,,,,,,,,,1,1,1,1,1,1,,,1,1,1,1,1,1,1,1,1,1,1,1,1,1,1,1,
���Ό�����,�a���S���i�����܂ށj,���R�s������4-381-2,35.8805391,139.9177359,04-7154-9101,,,,,,,,,,,,,,,,,,,,,,,,,,,,,,,,,1,1,1,1,1,,,,1,1,1,1,1,1,1,1,1,1,1,1,1,1,1,1,
���Ό�����,��P�E��Q�a��,���R�s������4-381-2,35.8805391,139.9177359,04-7154-9101,,,,,,,,,,,,,,,,,,,,,,,,,,,,,,,,,1,1,1,1,1,,,,1,,,1,1,1,1,1,1,1,1,,,,1,1,
���Ό�����,��P�a��,���R�s������4-381-2,35.8805391,139.9177359,04-7154-9101,,,,,,,,,,,,,,,,,,,,,,,,,,,,,,,,,1,1,1,1,1,,,,1,,,1,1,1,1,1,1,1,1,,,,1,1,
���Ό�����,��Q�a��,���R�s������4-381-2,35.8805391,139.9177359,04-7154-9101,,,,,,,,,,,,,,,,,,,,,,,,,,,,,,,,,1,1,1,1,1,,,,1,,,1,1,1,1,1,1,1,1,,,,1,1,
���Ό�����,����,���R�s������4-381-2,35.8805391,139.9177359,04-7154-9101,,,,,,,,,,,,,,,,,,,,,,,,,,,,,,,,,,1,,,,,,,,,,,,,,,,,,,,,,,
���Ό�����,������,���R�s������4-381-2,35.8805391,139.9177359,04-7154-9101,,,,,,,,,,,,,,,,,,,,,,,,,,,,,,,,,,,,,,,1,,,,,,,,,,,,,,,,,,
�여�R�Z���^�[,�z�[��,���R�s�여�R3-3-1,35.8388429,139.9017914,04-7159-4511,,,,,,,,,,,,,,,,,,,,,,,,,,,,,,,,,1,1,1,1,1,1,,1,1,1,1,1,1,1,1,1,1,1,1,1,1,1,1,1,
�여�R�Z���^�[,�u�`��,���R�s�여�R3-3-1,35.8388429,139.9017914,04-7159-4511,,,,,,,,,,,,,,,,,,,,,,,,,,,,,,,,,1,1,1,1,1,1,1,1,1,,,1,1,1,1,1,1,1,1,1,1,1,1,1,
�여�R�Z���^�[,��P��c��,���R�s�여�R3-3-1,35.8388429,139.9017914,04-7159-4511,,,,,,,,,,,,,,,,,,,,,,,,,,,,,,,,,1,1,1,1,1,1,1,1,1,,,1,1,1,1,1,1,1,1,1,1,1,1,1,
�여�R�Z���^�[,��Q��c��,���R�s�여�R3-3-1,35.8388429,139.9017914,04-7159-4511,,,,,,,,,,,,,,,,,,,,,,,,,,,,,,,,,1,1,1,1,1,1,1,1,1,,,1,1,1,1,1,1,1,1,1,1,1,1,1,
�여�R�Z���^�[,��R��c��,���R�s�여�R3-3-1,35.8388429,139.9017914,04-7159-4511,,,,,,,,,,,,,,,,,,,,,,,,,,,,,,,,,1,1,1,1,1,1,1,1,1,,,1,1,1,1,1,1,1,1,1,1,1,1,1,
�여�R�Z���^�[,��S��c��,���R�s�여�R3-3-1,35.8388429,139.9017914,04-7159-4511,,,,,,,,,,,,,,,,,,,,,,,,,,,,,,,,,1,1,1,1,1,1,1,1,1,,,1,1,1,1,1,1,1,1,1,1,1,1,1,
�여�R�Z���^�[,�a���S���i�����܂ށj,���R�s�여�R3-3-1,35.8388429,139.9017914,04-7159-4511,,,,,,,,,,,,,,,,,,,,,,,,,,,,,,,,,1,1,1,1,1,1,1,1,1,,,1,1,1,1,1,1,1,1,,,1,1,1,
�여�R�Z���^�[,��P�a���E��Q�a��,���R�s�여�R3-3-1,35.8388429,139.9017914,04-7159-4511,,,,,,,,,,,,,,,,,,,,,,,,,,,,,,,,,1,1,1,1,1,1,1,1,1,,,1,1,1,1,1,1,1,1,,,1,1,1,
�여�R�Z���^�[,��P�a��,���R�s�여�R3-3-1,35.8388429,139.9017914,04-7159-4511,,,,,,,,,,,,,,,,,,,,,,,,,,,,,,,,,1,1,1,1,1,1,1,1,1,,,1,1,1,1,1,1,1,1,,,1,1,1,
�여�R�Z���^�[,��Q�a��,���R�s�여�R3-3-1,35.8388429,139.9017914,04-7159-4511,,,,,,,,,,,,,,,,,,,,,,,,,,,,,,,,,1,1,1,1,1,1,1,1,1,,,1,1,1,1,1,1,1,1,,,1,1,1,
�여�R�Z���^�[,����,���R�s�여�R3-3-1,35.8388429,139.9017914,04-7159-4511,,,,,,,,,,,,,,,,,,,,,,,,,,,,,,,,,1,1,1,1,1,1,1,1,1,,,,,,,,,,,,,,1,1,
�여�R�Z���^�[,�������K��,���R�s�여�R3-3-1,35.8388429,139.9017914,04-7159-4511,,,,,,,,,,,,,,,,,,,,,,,,,,,,,,,,,,1,,,,,1,,1,,,,,,,,,,,,,,,1,
���������̐X�Z���^�[,�z�[��,���R�s���������̐X��2-13-1,35.867138,139.917537,04-7159-7031,,,,,,,,,,,,,,,,,,,,,,,,,,,,,,,,,1,,1,1,1,1,,,1,1,1,1,1,1,1,1,1,1,1,1,1,1,1,1,
���������̐X�Z���^�[,��c���P,���R�s���������̐X��2-13-1,35.867138,139.917537,04-7159-7031,,,,,,,,,,,,,,,,,,,,,,,,,,,,,,,,,1,,1,1,1,1,,,1,,,1,1,1,1,1,1,1,1,1,1,,1,1,
���������̐X�Z���^�[,��c���Q�i�S�ʁj,���R�s���������̐X��2-13-1,35.867138,139.917537,04-7159-7031,,,,,,,,,,,,,,,,,,,,,,,,,,,,,,,,,1,,1,1,1,1,,,1,,,1,1,1,1,1,1,1,1,1,1,,1,1,
���������̐X�Z���^�[,��c���Q�i�P�^�Q�`�ʁj,���R�s���������̐X��2-13-1,35.867138,139.917537,04-7159-7031,,,,,,,,,,,,,,,,,,,,,,,,,,,,,,,,,1,,1,1,1,1,,,1,,,1,1,1,1,1,1,1,1,1,1,,1,1,
���������̐X�Z���^�[,��c���Q�i�P�^�Q�a�ʁj,���R�s���������̐X��2-13-1,35.867138,139.917537,04-7159-7031,,,,,,,,,,,,,,,,,,,,,,,,,,,,,,,,,1,,1,1,1,1,,,1,,,1,1,1,1,1,1,1,1,1,1,,1,1,
���U�w�K�Z���^�[,���ړI�z�[��,���R�s��110,35.8536073,139.9175284,04-7150-7474,,,,,,,,,,,,,,,,,,,,,,,,,,1,,,,,,,,,,,,,,,1,1,1,1,1,1,1,1,1,1,1,,1,1,1,1,
���U�w�K�Z���^�[,�̈�فi�S�ʁj,���R�s��110,35.8536073,139.9175284,04-7150-7474,,,,,,,,,,,,,,,,,,,,,1,,,1,1,1,1,1,,,,1,,,,,,,,1,1,,,,,1,1,1,1,1,,,,,1,1,
���U�w�K�Z���^�[,�̈�ف@���ʁi�k�ʁj,���R�s��110,35.8536073,139.9175284,04-7150-7474,,,,,,,,,,,,,,,1,1,1,1,,1,1,,,1,1,1,1,1,,,,1,,,,,,,,1,1,,,,,1,1,1,1,1,,,,,1,1,
���U�w�K�Z���^�[,�̈�ف@���ʁi��ʁj,���R�s��110,35.8536073,139.9175284,04-7150-7474,,,,,,,,,,,,,1,1,1,1,1,1,,1,1,1,,1,1,1,1,1,,,,1,,,,,,,,1,1,,,,,1,1,1,1,1,,,,,1,1,
���U�w�K�Z���^�[,���K��,���R�s��110,35.8536073,139.9175284,04-7150-7474,,,,,,,,,,,,,,,,,,,,,,,,,,1,,,,,,,,,,,,,,1,1,,1,1,1,1,1,1,1,1,,,,,1,1,
���U�w�K�Z���^�[,�`�|�P�O�P�i����c���j,���R�s��110,35.8536073,139.9175284,04-7150-7474,,,,,,,,,,,,,,,,,,,,,,,,,,,,,,,,,1,1,1,1,1,1,,1,1,,,,,,1,1,1,1,1,,,,1,1,
���U�w�K�Z���^�[,�`�|�P�O�Q�i����c���j,���R�s��110,35.8536073,139.9175284,04-7150-7474,,,,,,,,,,,,,,,,,,,,,,,,,,,,,,,,,1,1,1,1,1,1,,1,1,,,,,,1,1,1,1,1,,,,1,1,
���U�w�K�Z���^�[,�`�|�P�O�R�i����c���j,���R�s��110,35.8536073,139.9175284,04-7150-7474,,,,,,,,,,,,,,,,,,,,,,,,,,,,,,,,,1,1,1,1,1,1,,1,1,,,,,,1,1,1,1,1,,,,1,1,
���U�w�K�Z���^�[,���y��,���R�s��110,35.8536073,139.9175284,04-7150-7474,,,,,,,,,,,,,,,,,,,,,,,,,,1,,,,,,,,,,,,,,,1,1,1,1,1,1,1,1,1,1,,,,,1,1,
���U�w�K�Z���^�[,�X�^�W�I���C��,���R�s��110,35.8536073,139.9175284,04-7150-7474,,,,,,,,,,,,,,,,,,,,,,,,,,1,,,,,,,,,,,,,,,1,1,1,1,1,1,1,1,1,1,,,,,1,1,
���U�w�K�Z���^�[,�`�|�Q�O�P�i�������C���j,���R�s��110,35.8536073,139.9175284,04-7150-7474,,,,,,,,,,,,,,,,,,,,,,,,,,,,,,,,,,,,,,,,,,,,1,1,1,1,1,1,,,,,,1,1,
���U�w�K�Z���^�[,�a�|�P�O�P�i����c���j,���R�s��110,35.8536073,139.9175284,04-7150-7474,,,,,,,,,,,,,,,,,,,,,,,,,,,,,,,,,1,1,1,1,1,1,,1,1,,,,,,1,1,1,1,,,,,1,1,
���U�w�K�Z���^�[,�C�x���g�L��,���R�s��110,35.8536073,139.9175284,04-7150-7474,,,,,,,,,,,,,,,,,,,,,,,,,,,,,,,,,,,,,,,,1,1,,,,,,1,1,1,1,,,,,1,1,
���U�w�K�Z���^�[,�~�[,���R�s��110,35.8536073,139.9175284,04-7150-7474,,,,,,,,,,,,,,,,,,,,,,,,,,,,,,,,,,,,,,,1,1,1,,,,,,,,1,,,,,,1,1,
���U�w�K�Z���^�[,�a���i�Q�e�j,���R�s��110,35.8536073,139.9175284,04-7150-7474,,,,,,,,,,,,,,,,,,,,,,,,,,,,,,,,,1,1,1,1,1,1,,1,1,,,,,,1,1,1,1,,,,,1,1,
���U�w�K�Z���^�[,�b�|�Q�O�P�i����c���j,���R�s��110,35.8536073,139.9175284,04-7150-7474,,,,,,,,,,,,,,,,,,,,,,,,,,,,,,,,,1,1,1,1,1,1,,1,1,,,,,,,,1,1,,,,,1,1,
���U�w�K�Z���^�[,�b�|�Q�O�Q�i����c���j,���R�s��110,35.8536073,139.9175284,04-7150-7474,,,,,,,,,,,,,,,,,,,,,,,,,,,,,,,,,1,1,1,1,1,1,,1,1,,,,,,,,1,1,,,,,1,1,
���U�w�K�Z���^�[,�b�|�Q�O�R�i����c���j,���R�s��110,35.8536073,139.9175284,04-7150-7474,,,,,,,,,,,,,,,,,,,,,,,,,,,,,,,,,1,1,1,1,1,1,,1,1,,,,,,,,1,1,,,,,1,1,
���U�w�K�Z���^�[,�b�|�Q�O�S�i����c���j,���R�s��110,35.8536073,139.9175284,04-7150-7474,,,,,,,,,,,,,,,,,,,,,,,,,,,,,,,,,1,1,1,1,1,1,,1,1,,,,,,,,1,1,,,,,1,1,
���U�w�K�Z���^�[,�b�|�Q�O�T�i����c���j,���R�s��110,35.8536073,139.9175284,04-7150-7474,,,,,,,,,,,,,,,,,,,,,,,,,,,,,,,,,1,1,1,1,1,1,,1,1,,,,,,,,1,1,,,,,1,1,
���U�w�K�Z���^�[,�b�|�Q�O�U�i����c���j,���R�s��110,35.8536073,139.9175284,04-7150-7474,,,,,,,,,,,,,,,,,,,,,,,,,,,,,,,,,1,1,1,1,1,1,,1,1,,,,,,,,1,1,,,,,1,1,
���U�w�K�Z���^�[,�b�|�Q�O�V�i����c���j,���R�s��110,35.8536073,139.9175284,04-7150-7474,,,,,,,,,,,,,,,,,,,,,,,,,,,,,,,,,1,1,1,1,1,1,,1,1,,,,,,1,1,1,1,1,,,,1,1,
���U�w�K�Z���^�[,�b�|�Q�O�W�i����c���j,���R�s��110,35.8536073,139.9175284,04-7150-7474,,,,,,,,,,,,,,,,,,,,,,,,,,,,,,,,,1,1,1,1,1,1,,1,1,,,,,,,,1,1,,,,,1,1,
���U�w�K�Z���^�[,�b�|�S�O�P�i���c���j,���R�s��110,35.8536073,139.9175284,04-7150-7474,,,,,,,,,,,,,,,,,,,,,,,,,,,,,,,,,1,1,1,1,1,1,,1,1,,,,,,1,1,1,1,1,,,,1,1,
���U�w�K�Z���^�[,�b�|�S�O�Q�i����c���j,���R�s��110,35.8536073,139.9175284,04-7150-7474,,,,,,,,,,,,,,,,,,,,,,,,,,,,,,,,,1,1,1,1,1,1,,1,1,,,,,,,,1,1,,,,,1,1,
���U�w�K�Z���^�[,�a���i�����j,���R�s��110,35.8536073,139.9175284,04-7150-7474,,,,,,,,,,,,,,,,,,,,,,,,,,,,,,,,,1,1,1,1,1,1,,1,1,,,,,,1,1,1,1,,,,,1,1,
���U�w�K�Z���^�[,���p��,���R�s��110,35.8536073,139.9175284,04-7150-7474,,,,,,,,,,,,,,,,,,,,,,,,,,,,,,,,,1,1,1,1,1,1,,1,1,,,,,,,,1,,,,,,1,1,
���U�w�K�Z���^�[,��P�M�������[,���R�s��110,35.8536073,139.9175284,04-7150-7474,,,,,,,,,,,,,,,,,,,,,,,,,,,,,,,,,,,,,,,,1,1,,,,,,1,,1,,,1,,,1,1,